Bumps version to 1.0.0

1 job for releases in 2 minutes and 34 seconds (queued for 8 seconds)
latest
Status Job ID Name Coverage
  Test
failed #1868
test-and-build-repository

00:02:34

 
Name Stage Failure
failed
test-and-build-repository Test There is an unknown failure, please try again
141164 [ERROR] 
141164 [ERROR] Re-run Maven using the -X switch to enable full debug logging.
141164 [ERROR]
141164 [ERROR] For more information about the errors and possible solutions, please read the following articles:
141164 [ERROR] [Help 1] http://cwiki.apache.org/confluence/display/MAVEN/MojoExecutionException
141165 [ERROR]
141165 [ERROR] After correcting the problems, you can resume the build with the command
141165 [ERROR] mvn <goals> -rf :language-integration.core
ERROR: Build failed: exit code 1